{"text_format":"1","workbook":"xlsx","n_sheets":3,"sheets":["Mortgage Calculator","Amortization Schedule","Ref"],"not_rendered":{"charts":2,"images":2,"macros":1,"external_links":0,"defined_names":4,"comments":0,"pivot_tables":0},"unopened":[],"bounds":{"document_bytes":16777216,"sheet_cells":100000,"rows_first":2000,"rows_last":500,"rows_between":2000,"halvings":0,"cell_chars":16384,"cell_head_chars":4096},"cells_cut":0,"cells_raw":0,"read":"whole","date_system":"1900"}

{"sheet":"Mortgage Calculator","index":0,"n_rows":29,"n_cols":17,"rows_kept":29,"cut":false,"hidden":false,"merged":[[28,2,28,3],[17,7,17,16],[3,1,3,4],[17,1,17,5],[0,3,1,9],[27,2,27,3]]}
[null,null,null,"Mortgage Repayment & Amortization Calculator",null,null,null,null,null,null,null,null,null,null,null,"Currency Select","USD"]
[]
[null,null,null,null,null,null,null,null,null,null,null,null,null,null,null,null,"Help"]
[null,"Data Inputs"]
[]
[null,null,"Loan Amount",250000]
[null,null,"Interest Rate",0.05]
[null,null,"Loan Term (Years)",25]
[null,null,"No of Payments per Year",12]
[null,null,"Loan Repayment Start Date",{"$f":"TODAY()","v":"2024-01-12"}]
[]
[null,null,"Optional Extra Monthly Payment",0]
[]
[]
[]
[]
[null,null,null,null,null,null,null,null,null,null,null,null,null,null,null,null,"Full Schedule"]
[null,"Loan Summary Report",null,null,null,null,null,"Mortgage Amortization Schedule Snapshot"]
[null,null,null,null,null,null,null,"Payment Number","Payment Date","Start Balance","Scheduled Payment","Additional Payment Made","Total Payment","Principal Portion of Payment","Interest Portion of Payment","End Balance","Cumulative Interest Paid"]
[null,null,"Total Amount Repaid",438442.53113098635,null,null,null,{"$f":"IFERROR(INDEX(AmortizationData, ROWS($H$20:H20) + Ref!$A$2 - 1, COLUMN(H20)-COLUMN($H$20)+1), \"\")","v":1},{"$f":"IFERROR(INDEX(AmortizationData, ROWS($H$20:I20) + Ref!$A$2 - 1, COLUMN(I20)-COLUMN($H$20)+1), \"\")","v":"2024-01-12"},{"$f":"IFERROR(INDEX(AmortizationData, ROWS($H$20:J20) + Ref!$A$2 - 1, COLUMN(J20)-COLUMN($H$20)+1), \"\")","v":250000},{"$f":"IFERROR(INDEX(AmortizationData, ROWS($H$20:K20) + Ref!$A$2 - 1, COLUMN(K20)-COLUMN($H$20)+1), \"\")","v":1461.4751037699502},{"$f":"IFERROR(INDEX(AmortizationData, ROWS($H$20:L20) + Ref!$A$2 - 1, COLUMN(L20)-COLUMN($H$20)+1), \"\")","v":0},{"$f":"IFERROR(INDEX(AmortizationData, ROWS($H$20:M20) + Ref!$A$2 - 1, COLUMN(M20)-COLUMN($H$20)+1), \"\")","v":1461.4751037699502},{"$f":"IFERROR(INDEX(AmortizationData, ROWS($H$20:N20) + Ref!$A$2 - 1, COLUMN(N20)-COLUMN($H$20)+1), \"\")","v":419.8084371032835},{"$f":"IFERROR(INDEX(AmortizationData, ROWS($H$20:O20) + Ref!$A$2 - 1, COLUMN(O20)-COLUMN($H$20)+1), \"\")","v":1041.6666666666667},{"$f":"IFERROR(INDEX(AmortizationData, ROWS($H$20:P20) + Ref!$A$2 - 1, COLUMN(P20)-COLUMN($H$20)+1), \"\")","v":249580.19156289671},{"$f":"IFERROR(INDEX(AmortizationData, ROWS($H$20:Q20) + Ref!$A$2 - 1, COLUMN(Q20)-COLUMN($H$20)+1), \"\")","v":1041.6666666666667}]
[null,null,"Princpal",250000.0000000002,null,null,null,{"$f":"IFERROR(INDEX(AmortizationData, ROWS($H$20:H21) + Ref!$A$2 - 1, COLUMN(H21)-COLUMN($H$20)+1), \"\")","v":2},{"$f":"IFERROR(INDEX(AmortizationData, ROWS($H$20:I21) + Ref!$A$2 - 1, COLUMN(I21)-COLUMN($H$20)+1), \"\")","v":"2024-02-12"},{"$f":"IFERROR(INDEX(AmortizationData, ROWS($H$20:J21) + Ref!$A$2 - 1, COLUMN(J21)-COLUMN($H$20)+1), \"\")","v":249580.19156289671},{"$f":"IFERROR(INDEX(AmortizationData, ROWS($H$20:K21) + Ref!$A$2 - 1, COLUMN(K21)-COLUMN($H$20)+1), \"\")","v":1461.4751037699502},{"$f":"IFERROR(INDEX(AmortizationData, ROWS($H$20:L21) + Ref!$A$2 - 1, COLUMN(L21)-COLUMN($H$20)+1), \"\")","v":0},{"$f":"IFERROR(INDEX(AmortizationData, ROWS($H$20:M21) + Ref!$A$2 - 1, COLUMN(M21)-COLUMN($H$20)+1), \"\")","v":1461.4751037699502},{"$f":"IFERROR(INDEX(AmortizationData, ROWS($H$20:N21) + Ref!$A$2 - 1, COLUMN(N21)-COLUMN($H$20)+1), \"\")","v":421.55763892454729},{"$f":"IFERROR(INDEX(AmortizationData, ROWS($H$20:O21) + Ref!$A$2 - 1, COLUMN(O21)-COLUMN($H$20)+1), \"\")","v":1039.9174648454029},{"$f":"IFERROR(INDEX(AmortizationData, ROWS($H$20:P21) + Ref!$A$2 - 1, COLUMN(P21)-COLUMN($H$20)+1), \"\")","v":249158.63392397217},{"$f":"IFERROR(INDEX(AmortizationData, ROWS($H$20:Q21) + Ref!$A$2 - 1, COLUMN(Q21)-COLUMN($H$20)+1), \"\")","v":2081.5841315120697}]
[null,null,"Interest",188442.53113098364,null,null,null,{"$f":"IFERROR(INDEX(AmortizationData, ROWS($H$20:H22) + Ref!$A$2 - 1, COLUMN(H22)-COLUMN($H$20)+1), \"\")","v":3},{"$f":"IFERROR(INDEX(AmortizationData, ROWS($H$20:I22) + Ref!$A$2 - 1, COLUMN(I22)-COLUMN($H$20)+1), \"\")","v":"2024-03-12"},{"$f":"IFERROR(INDEX(AmortizationData, ROWS($H$20:J22) + Ref!$A$2 - 1, COLUMN(J22)-COLUMN($H$20)+1), \"\")","v":249158.63392397217},{"$f":"IFERROR(INDEX(AmortizationData, ROWS($H$20:K22) + Ref!$A$2 - 1, COLUMN(K22)-COLUMN($H$20)+1), \"\")","v":1461.4751037699502},{"$f":"IFERROR(INDEX(AmortizationData, ROWS($H$20:L22) + Ref!$A$2 - 1, COLUMN(L22)-COLUMN($H$20)+1), \"\")","v":0},{"$f":"IFERROR(INDEX(AmortizationData, ROWS($H$20:M22) + Ref!$A$2 - 1, COLUMN(M22)-COLUMN($H$20)+1), \"\")","v":1461.4751037699502},{"$f":"IFERROR(INDEX(AmortizationData, ROWS($H$20:N22) + Ref!$A$2 - 1, COLUMN(N22)-COLUMN($H$20)+1), \"\")","v":423.31412908673269},{"$f":"IFERROR(INDEX(AmortizationData, ROWS($H$20:O22) + Ref!$A$2 - 1, COLUMN(O22)-COLUMN($H$20)+1), \"\")","v":1038.1609746832175},{"$f":"IFERROR(INDEX(AmortizationData, ROWS($H$20:P22) + Ref!$A$2 - 1, COLUMN(P22)-COLUMN($H$20)+1), \"\")","v":248735.31979488544},{"$f":"IFERROR(INDEX(AmortizationData, ROWS($H$20:Q22) + Ref!$A$2 - 1, COLUMN(Q22)-COLUMN($H$20)+1), \"\")","v":3119.745106195287}]
[null,null,null,null,null,null,null,{"$f":"IFERROR(INDEX(AmortizationData, ROWS($H$20:H23) + Ref!$A$2 - 1, COLUMN(H23)-COLUMN($H$20)+1), \"\")","v":4},{"$f":"IFERROR(INDEX(AmortizationData, ROWS($H$20:I23) + Ref!$A$2 - 1, COLUMN(I23)-COLUMN($H$20)+1), \"\")","v":"2024-04-12"},{"$f":"IFERROR(INDEX(AmortizationData, ROWS($H$20:J23) + Ref!$A$2 - 1, COLUMN(J23)-COLUMN($H$20)+1), \"\")","v":248735.31979488544},{"$f":"IFERROR(INDEX(AmortizationData, ROWS($H$20:K23) + Ref!$A$2 - 1, COLUMN(K23)-COLUMN($H$20)+1), \"\")","v":1461.4751037699502},{"$f":"IFERROR(INDEX(AmortizationData, ROWS($H$20:L23) + Ref!$A$2 - 1, COLUMN(L23)-COLUMN($H$20)+1), \"\")","v":0},{"$f":"IFERROR(INDEX(AmortizationData, ROWS($H$20:M23) + Ref!$A$2 - 1, COLUMN(M23)-COLUMN($H$20)+1), \"\")","v":1461.4751037699502},{"$f":"IFERROR(INDEX(AmortizationData, ROWS($H$20:N23) + Ref!$A$2 - 1, COLUMN(N23)-COLUMN($H$20)+1), \"\")","v":425.07793795792759},{"$f":"IFERROR(INDEX(AmortizationData, ROWS($H$20:O23) + Ref!$A$2 - 1, COLUMN(O23)-COLUMN($H$20)+1), \"\")","v":1036.3971658120226},{"$f":"IFERROR(INDEX(AmortizationData, ROWS($H$20:P23) + Ref!$A$2 - 1, COLUMN(P23)-COLUMN($H$20)+1), \"\")","v":248310.24185692752},{"$f":"IFERROR(INDEX(AmortizationData, ROWS($H$20:Q23) + Ref!$A$2 - 1, COLUMN(Q23)-COLUMN($H$20)+1), \"\")","v":4156.1422720073097}]
[null,null,"Scheduled Payment",1461.4751037699502,null,null,null,{"$f":"IFERROR(INDEX(AmortizationData, ROWS($H$20:H24) + Ref!$A$2 - 1, COLUMN(H24)-COLUMN($H$20)+1), \"\")","v":5},{"$f":"IFERROR(INDEX(AmortizationData, ROWS($H$20:I24) + Ref!$A$2 - 1, COLUMN(I24)-COLUMN($H$20)+1), \"\")","v":"2024-05-12"},{"$f":"IFERROR(INDEX(AmortizationData, ROWS($H$20:J24) + Ref!$A$2 - 1, COLUMN(J24)-COLUMN($H$20)+1), \"\")","v":248310.24185692752},{"$f":"IFERROR(INDEX(AmortizationData, ROWS($H$20:K24) + Ref!$A$2 - 1, COLUMN(K24)-COLUMN($H$20)+1), \"\")","v":1461.4751037699502},{"$f":"IFERROR(INDEX(AmortizationData, ROWS($H$20:L24) + Ref!$A$2 - 1, COLUMN(L24)-COLUMN($H$20)+1), \"\")","v":0},{"$f":"IFERROR(INDEX(AmortizationData, ROWS($H$20:M24) + Ref!$A$2 - 1, COLUMN(M24)-COLUMN($H$20)+1), \"\")","v":1461.4751037699502},{"$f":"IFERROR(INDEX(AmortizationData, ROWS($H$20:N24) + Ref!$A$2 - 1, COLUMN(N24)-COLUMN($H$20)+1), \"\")","v":426.84909603275219},{"$f":"IFERROR(INDEX(AmortizationData, ROWS($H$20:O24) + Ref!$A$2 - 1, COLUMN(O24)-COLUMN($H$20)+1), \"\")","v":1034.6260077371981},{"$f":"IFERROR(INDEX(AmortizationData, ROWS($H$20:P24) + Ref!$A$2 - 1, COLUMN(P24)-COLUMN($H$20)+1), \"\")","v":247883.39276089476},{"$f":"IFERROR(INDEX(AmortizationData, ROWS($H$20:Q24) + Ref!$A$2 - 1, COLUMN(Q24)-COLUMN($H$20)+1), \"\")","v":5190.7682797445077}]
[null,null,"Number of Payments",300,null,null,null,{"$f":"IFERROR(INDEX(AmortizationData, ROWS($H$20:H25) + Ref!$A$2 - 1, COLUMN(H25)-COLUMN($H$20)+1), \"\")","v":6},{"$f":"IFERROR(INDEX(AmortizationData, ROWS($H$20:I25) + Ref!$A$2 - 1, COLUMN(I25)-COLUMN($H$20)+1), \"\")","v":"2024-06-12"},{"$f":"IFERROR(INDEX(AmortizationData, ROWS($H$20:J25) + Ref!$A$2 - 1, COLUMN(J25)-COLUMN($H$20)+1), \"\")","v":247883.39276089476},{"$f":"IFERROR(INDEX(AmortizationData, ROWS($H$20:K25) + Ref!$A$2 - 1, COLUMN(K25)-COLUMN($H$20)+1), \"\")","v":1461.4751037699502},{"$f":"IFERROR(INDEX(AmortizationData, ROWS($H$20:L25) + Ref!$A$2 - 1, COLUMN(L25)-COLUMN($H$20)+1), \"\")","v":0},{"$f":"IFERROR(INDEX(AmortizationData, ROWS($H$20:M25) + Ref!$A$2 - 1, COLUMN(M25)-COLUMN($H$20)+1), \"\")","v":1461.4751037699502},{"$f":"IFERROR(INDEX(AmortizationData, ROWS($H$20:N25) + Ref!$A$2 - 1, COLUMN(N25)-COLUMN($H$20)+1), \"\")","v":428.62763393288878},{"$f":"IFERROR(INDEX(AmortizationData, ROWS($H$20:O25) + Ref!$A$2 - 1, COLUMN(O25)-COLUMN($H$20)+1), \"\")","v":1032.8474698370615},{"$f":"IFERROR(INDEX(AmortizationData, ROWS($H$20:P25) + Ref!$A$2 - 1, COLUMN(P25)-COLUMN($H$20)+1), \"\")","v":247454.76512696187},{"$f":"IFERROR(INDEX(AmortizationData, ROWS($H$20:Q25) + Ref!$A$2 - 1, COLUMN(Q25)-COLUMN($H$20)+1), \"\")","v":6223.6157495815696}]
[null,null,"Final Payment Date","2049-01-12",null,null,null,{"$f":"IFERROR(INDEX(AmortizationData, ROWS($H$20:H26) + Ref!$A$2 - 1, COLUMN(H26)-COLUMN($H$20)+1), \"\")","v":7},{"$f":"IFERROR(INDEX(AmortizationData, ROWS($H$20:I26) + Ref!$A$2 - 1, COLUMN(I26)-COLUMN($H$20)+1), \"\")","v":"2024-07-12"},{"$f":"IFERROR(INDEX(AmortizationData, ROWS($H$20:J26) + Ref!$A$2 - 1, COLUMN(J26)-COLUMN($H$20)+1), \"\")","v":247454.76512696187},{"$f":"IFERROR(INDEX(AmortizationData, ROWS($H$20:K26) + Ref!$A$2 - 1, COLUMN(K26)-COLUMN($H$20)+1), \"\")","v":1461.4751037699502},{"$f":"IFERROR(INDEX(AmortizationData, ROWS($H$20:L26) + Ref!$A$2 - 1, COLUMN(L26)-COLUMN($H$20)+1), \"\")","v":0},{"$f":"IFERROR(INDEX(AmortizationData, ROWS($H$20:M26) + Ref!$A$2 - 1, COLUMN(M26)-COLUMN($H$20)+1), \"\")","v":1461.4751037699502},{"$f":"IFERROR(INDEX(AmortizationData, ROWS($H$20:N26) + Ref!$A$2 - 1, COLUMN(N26)-COLUMN($H$20)+1), \"\")","v":430.41358240760906},{"$f":"IFERROR(INDEX(AmortizationData, ROWS($H$20:O26) + Ref!$A$2 - 1, COLUMN(O26)-COLUMN($H$20)+1), \"\")","v":1031.0615213623412},{"$f":"IFERROR(INDEX(AmortizationData, ROWS($H$20:P26) + Ref!$A$2 - 1, COLUMN(P26)-COLUMN($H$20)+1), \"\")","v":247024.35154455426},{"$f":"IFERROR(INDEX(AmortizationData, ROWS($H$20:Q26) + Ref!$A$2 - 1, COLUMN(Q26)-COLUMN($H$20)+1), \"\")","v":7254.677270943911}]
[null,null,null,null,null,null,null,{"$f":"IFERROR(INDEX(AmortizationData, ROWS($H$20:H27) + Ref!$A$2 - 1, COLUMN(H27)-COLUMN($H$20)+1), \"\")","v":8},{"$f":"IFERROR(INDEX(AmortizationData, ROWS($H$20:I27) + Ref!$A$2 - 1, COLUMN(I27)-COLUMN($H$20)+1), \"\")","v":"2024-08-12"},{"$f":"IFERROR(INDEX(AmortizationData, ROWS($H$20:J27) + Ref!$A$2 - 1, COLUMN(J27)-COLUMN($H$20)+1), \"\")","v":247024.35154455426},{"$f":"IFERROR(INDEX(AmortizationData, ROWS($H$20:K27) + Ref!$A$2 - 1, COLUMN(K27)-COLUMN($H$20)+1), \"\")","v":1461.4751037699502},{"$f":"IFERROR(INDEX(AmortizationData, ROWS($H$20:L27) + Ref!$A$2 - 1, COLUMN(L27)-COLUMN($H$20)+1), \"\")","v":0},{"$f":"IFERROR(INDEX(AmortizationData, ROWS($H$20:M27) + Ref!$A$2 - 1, COLUMN(M27)-COLUMN($H$20)+1), \"\")","v":1461.4751037699502},{"$f":"IFERROR(INDEX(AmortizationData, ROWS($H$20:N27) + Ref!$A$2 - 1, COLUMN(N27)-COLUMN($H$20)+1), \"\")","v":432.20697233430747},{"$f":"IFERROR(INDEX(AmortizationData, ROWS($H$20:O27) + Ref!$A$2 - 1, COLUMN(O27)-COLUMN($H$20)+1), \"\")","v":1029.2681314356428},{"$f":"IFERROR(INDEX(AmortizationData, ROWS($H$20:P27) + Ref!$A$2 - 1, COLUMN(P27)-COLUMN($H$20)+1), \"\")","v":246592.14457221996},{"$f":"IFERROR(INDEX(AmortizationData, ROWS($H$20:Q27) + Ref!$A$2 - 1, COLUMN(Q27)-COLUMN($H$20)+1), \"\")","v":8283.9454023795533}]
[null,null,null,null,null,null,null,{"$f":"IFERROR(INDEX(AmortizationData, ROWS($H$20:H28) + Ref!$A$2 - 1, COLUMN(H28)-COLUMN($H$20)+1), \"\")","v":9},{"$f":"IFERROR(INDEX(AmortizationData, ROWS($H$20:I28) + Ref!$A$2 - 1, COLUMN(I28)-COLUMN($H$20)+1), \"\")","v":"2024-09-12"},{"$f":"IFERROR(INDEX(AmortizationData, ROWS($H$20:J28) + Ref!$A$2 - 1, COLUMN(J28)-COLUMN($H$20)+1), \"\")","v":246592.14457221996},{"$f":"IFERROR(INDEX(AmortizationData, ROWS($H$20:K28) + Ref!$A$2 - 1, COLUMN(K28)-COLUMN($H$20)+1), \"\")","v":1461.4751037699502},{"$f":"IFERROR(INDEX(AmortizationData, ROWS($H$20:L28) + Ref!$A$2 - 1, COLUMN(L28)-COLUMN($H$20)+1), \"\")","v":0},{"$f":"IFERROR(INDEX(AmortizationData, ROWS($H$20:M28) + Ref!$A$2 - 1, COLUMN(M28)-COLUMN($H$20)+1), \"\")","v":1461.4751037699502},{"$f":"IFERROR(INDEX(AmortizationData, ROWS($H$20:N28) + Ref!$A$2 - 1, COLUMN(N28)-COLUMN($H$20)+1), \"\")","v":434.00783471903378},{"$f":"IFERROR(INDEX(AmortizationData, ROWS($H$20:O28) + Ref!$A$2 - 1, COLUMN(O28)-COLUMN($H$20)+1), \"\")","v":1027.4672690509165},{"$f":"IFERROR(INDEX(AmortizationData, ROWS($H$20:P28) + Ref!$A$2 - 1, COLUMN(P28)-COLUMN($H$20)+1), \"\")","v":246158.13673750093},{"$f":"IFERROR(INDEX(AmortizationData, ROWS($H$20:Q28) + Ref!$A$2 - 1, COLUMN(Q28)-COLUMN($H$20)+1), \"\")","v":9311.4126714304693}]
[null,null,null,null,null,null,null,{"$f":"IFERROR(INDEX(AmortizationData, ROWS($H$20:H29) + Ref!$A$2 - 1, COLUMN(H29)-COLUMN($H$20)+1), \"\")","v":10},{"$f":"IFERROR(INDEX(AmortizationData, ROWS($H$20:I29) + Ref!$A$2 - 1, COLUMN(I29)-COLUMN($H$20)+1), \"\")","v":"2024-10-12"},{"$f":"IFERROR(INDEX(AmortizationData, ROWS($H$20:J29) + Ref!$A$2 - 1, COLUMN(J29)-COLUMN($H$20)+1), \"\")","v":246158.13673750093},{"$f":"IFERROR(INDEX(AmortizationData, ROWS($H$20:K29) + Ref!$A$2 - 1, COLUMN(K29)-COLUMN($H$20)+1), \"\")","v":1461.4751037699502},{"$f":"IFERROR(INDEX(AmortizationData, ROWS($H$20:L29) + Ref!$A$2 - 1, COLUMN(L29)-COLUMN($H$20)+1), \"\")","v":0},{"$f":"IFERROR(INDEX(AmortizationData, ROWS($H$20:M29) + Ref!$A$2 - 1, COLUMN(M29)-COLUMN($H$20)+1), \"\")","v":1461.4751037699502},{"$f":"IFERROR(INDEX(AmortizationData, ROWS($H$20:N29) + Ref!$A$2 - 1, COLUMN(N29)-COLUMN($H$20)+1), \"\")","v":435.81620069702967},{"$f":"IFERROR(INDEX(AmortizationData, ROWS($H$20:O29) + Ref!$A$2 - 1, COLUMN(O29)-COLUMN($H$20)+1), \"\")","v":1025.6589030729206},{"$f":"IFERROR(INDEX(AmortizationData, ROWS($H$20:P29) + Ref!$A$2 - 1, COLUMN(P29)-COLUMN($H$20)+1), \"\")","v":245722.32053680389},{"$f":"IFERROR(INDEX(AmortizationData, ROWS($H$20:Q29) + Ref!$A$2 - 1, COLUMN(Q29)-COLUMN($H$20)+1), \"\")","v":10337.07157450339}]

{"sheet":"Amortization Schedule","index":1,"n_rows":305,"n_cols":10,"rows_kept":305,"cut":false,"hidden":false,"merged":[[3,0,3,9]]}
[]
[]
[]
["Mortgage Amortization Schedule"]
["Payment Number","Payment Date","Start Balance","Scheduled Payment","Additional Payment Made","Total Payment","Principal Portion of Payment","Interest Portion of Payment","End Balance","Cumulative Interest Paid"]
[1,"2024-01-12",250000,1461.4751037699502,0,1461.4751037699502,419.8084371032835,1041.6666666666667,249580.19156289671,1041.6666666666667]
[2,"2024-02-12",249580.19156289671,1461.4751037699502,0,1461.4751037699502,421.55763892454729,1039.9174648454029,249158.63392397217,2081.5841315120697]
[3,"2024-03-12",249158.63392397217,1461.4751037699502,0,1461.4751037699502,423.31412908673269,1038.1609746832175,248735.31979488544,3119.745106195287]
[4,"2024-04-12",248735.31979488544,1461.4751037699502,0,1461.4751037699502,425.07793795792759,1036.3971658120226,248310.24185692752,4156.1422720073097]
[5,"2024-05-12",248310.24185692752,1461.4751037699502,0,1461.4751037699502,426.84909603275219,1034.6260077371981,247883.39276089476,5190.7682797445077]
[6,"2024-06-12",247883.39276089476,1461.4751037699502,0,1461.4751037699502,428.62763393288878,1032.8474698370615,247454.76512696187,6223.6157495815696]
[7,"2024-07-12",247454.76512696187,1461.4751037699502,0,1461.4751037699502,430.41358240760906,1031.0615213623412,247024.35154455426,7254.677270943911]
[8,"2024-08-12",247024.35154455426,1461.4751037699502,0,1461.4751037699502,432.20697233430747,1029.2681314356428,246592.14457221996,8283.9454023795533]
[9,"2024-09-12",246592.14457221996,1461.4751037699502,0,1461.4751037699502,434.00783471903378,1027.4672690509165,246158.13673750093,9311.4126714304693]
[10,"2024-10-12",246158.13673750093,1461.4751037699502,0,1461.4751037699502,435.81620069702967,1025.6589030729206,245722.32053680389,10337.07157450339]
[11,"2024-11-12",245722.32053680389,1461.4751037699502,0,1461.4751037699502,437.63210153326736,1023.8430022366829,245284.68843527063,11360.914576740073]
[12,"2024-12-12",245284.68843527063,1461.4751037699502,0,1461.4751037699502,439.45556862298929,1022.0195351469609,244845.23286664762,12382.934111887034]
[13,"2025-01-12",244845.23286664762,1461.4751037699502,0,1461.4751037699502,441.28663349225178,1020.1884702776985,244403.94623315538,13403.122582164733]
[14,"2025-02-12",244403.94623315538,1461.4751037699502,0,1461.4751037699502,443.12532779846947,1018.3497759714808,243960.8209053569,14421.472358136214]
[15,"2025-03-12",243960.8209053569,1461.4751037699502,0,1461.4751037699502,444.97168333096306,1016.5034204389872,243515.84922202595,15437.975778575201]
[16,"2025-04-12",243515.84922202595,1461.4751037699502,0,1461.4751037699502,446.82573201150876,1014.6493717584415,243069.02349001443,16452.625150333643]
[17,"2025-05-12",243069.02349001443,1461.4751037699502,0,1461.4751037699502,448.68750589489002,1012.7875978750602,242620.33598411953,17465.412748208702]
[18,"2025-06-12",242620.33598411953,1461.4751037699502,0,1461.4751037699502,450.55703716945209,1010.9180666004982,242169.77894695007,18476.3308148092]
[19,"2025-07-12",242169.77894695007,1461.4751037699502,0,1461.4751037699502,452.43435815765827,1009.040745612292,241717.34458879242,19485.371560421492]
[20,"2025-08-12",241717.34458879242,1461.4751037699502,0,1461.4751037699502,454.31950131664848,1007.1556024533018,241263.02508747578,20492.527162874794]
[21,"2025-09-12",241263.02508747578,1461.4751037699502,0,1461.4751037699502,456.21249923880112,1005.2626045311491,240806.81258823696,21497.789767405942]
[22,"2025-10-12",240806.81258823696,1461.4751037699502,0,1461.4751037699502,458.11338465229619,1003.361719117654,240348.69920358466,22501.151486523595]
[23,"2025-11-12",240348.69920358466,1461.4751037699502,0,1461.4751037699502,460.02219042168076,1001.4529133482695,239888.67701316299,23502.604399871863]
[24,"2025-12-12",239888.67701316299,1461.4751037699502,0,1461.4751037699502,461.93894954843768,999.53615422151256,239426.73806361455,24502.140554093377]
[25,"2026-01-12",239426.73806361455,1461.4751037699502,0,1461.4751037699502,463.86369517155617,997.61140859839406,238962.87436844301,25499.751962691771]
[26,"2026-02-12",238962.87436844301,1461.4751037699502,0,1461.4751037699502,465.79646056810429,995.67864320184594,238497.07790787492,26495.430605893616]
[27,"2026-03-12",238497.07790787492,1461.4751037699502,0,1461.4751037699502,467.73727915380471,993.73782461614553,238029.34062872111,27489.168430509762]
[28,"2026-04-12",238029.34062872111,1461.4751037699502,0,1461.4751037699502,469.68618448361224,991.788919286338,237559.6544442375,28480.957349796099]
[29,"2026-05-12",237559.6544442375,1461.4751037699502,0,1461.4751037699502,471.6432102522939,989.83189351765634,237088.01123398522,29470.789243313757]
[30,"2026-06-12",237088.01123398522,1461.4751037699502,0,1461.4751037699502,473.60839029501176,987.86671347493848,236614.40284369022,30458.655956788694]
[31,"2026-07-12",236614.40284369022,1461.4751037699502,0,1461.4751037699502,475.58175858790764,985.89334518204259,236138.8210851023,31444.549301970736]
[32,"2026-08-12",236138.8210851023,1461.4751037699502,0,1461.4751037699502,477.56334924869054,983.9117545212597,235661.25773585361,32428.461056491997]
[33,"2026-09-12",235661.25773585361,1461.4751037699502,0,1461.4751037699502,479.55319653722677,981.92190723272347,235181.70453931639,33410.382963724718]
[34,"2026-10-12",235181.70453931639,1461.4751037699502,0,1461.4751037699502,481.55133485613192,979.92376891381832,234700.15320446025,34390.306732638535]
[35,"2026-11-12",234700.15320446025,1461.4751037699502,0,1461.4751037699502,483.55779875136579,977.91730501858444,234216.59540570888,35368.224037657121]
[36,"2026-12-12",234216.59540570888,1461.4751037699502,0,1461.4751037699502,485.57262291282984,975.90248085712039,233731.02278279606,36344.12651851424]
[37,"2027-01-12",233731.02278279606,1461.4751037699502,0,1461.4751037699502,487.59584217496661,973.87926159498363,233243.42694062111,37318.005780109226]
[38,"2027-02-12",233243.42694062111,1461.4751037699502,0,1461.4751037699502,489.62749151736227,971.84761225258796,232753.79944910374,38289.853392361816]
[39,"2027-03-12",232753.79944910374,1461.4751037699502,0,1461.4751037699502,491.66760606535126,969.80749770459897,232262.1318430384,39259.660890066414]
[40,"2027-04-12",232262.1318430384,1461.4751037699502,0,1461.4751037699502,493.71622109062355,967.75888267932669,231768.41562194779,40227.419772745743]
[41,"2027-05-12",231768.41562194779,1461.4751037699502,0,1461.4751037699502,495.77337201183445,965.70173175811578,231272.64224993595,41193.121504503855]
[42,"2027-06-12",231272.64224993595,1461.4751037699502,0,1461.4751037699502,497.8390943952171,963.63600937473313,230774.80315554072,42156.757513878591]
[43,"2027-07-12",230774.80315554072,1461.4751037699502,0,1461.4751037699502,499.91342395519723,961.56167981475301,230274.88973158551,43118.319193693344]
[44,"2027-08-12",230274.88973158551,1461.4751037699502,0,1461.4751037699502,501.99639655501051,959.47870721493973,229772.8933350305,44077.797900908285]
[45,"2027-09-12",229772.8933350305,1461.4751037699502,0,1461.4751037699502,504.08804820732314,957.3870555626271,229268.80528682319,45035.184956470912]
[46,"2027-10-12",229268.80528682319,1461.4751037699502,0,1461.4751037699502,506.18841507485354,955.2866886950967,228762.61687174832,45990.471645166006]
[47,"2027-11-12",228762.61687174832,1461.4751037699502,0,1461.4751037699502,508.29753347099881,953.17757029895142,228254.31933827733,46943.64921546496]
[48,"2027-12-12",228254.31933827733,1461.4751037699502,0,1461.4751037699502,510.41543986046133,951.0596639094889,227743.90389841687,47894.708879374448]
[49,"2028-01-12",227743.90389841687,1461.4751037699502,0,1461.4751037699502,512.54217085987989,948.93293291007035,227231.361727557,48843.641812284521]
[50,"2028-02-12",227231.361727557,1461.4751037699502,0,1461.4751037699502,514.67776323846272,946.79734053148752,226716.68396431854,49790.439152816005]
[51,"2028-03-12",226716.68396431854,1461.4751037699502,0,1461.4751037699502,516.82225391862289,944.65284985132735,226199.86171039991,50735.092002667334]
[52,"2028-04-12",226199.86171039991,1461.4751037699502,0,1461.4751037699502,518.97567997661724,942.49942379333299,225680.88603042331,51677.591426460669]
[53,"2028-05-12",225680.88603042331,1461.4751037699502,0,1461.4751037699502,521.13807864318642,940.33702512676382,225159.74795178013,52617.928451587431]
[54,"2028-06-12",225159.74795178013,1461.4751037699502,0,1461.4751037699502,523.30948730419971,938.16561646575053,224636.43846447591,53556.094068053178]
[55,"2028-07-12",224636.43846447591,1461.4751037699502,0,1461.4751037699502,525.48994350130056,935.98516026864968,224110.94852097461,54492.079228321825]
{"$rows_left_out":246}
{"sheet":"Ref","index":2,"n_rows":2,"n_cols":1,"rows_kept":2,"cut":false,"hidden":true,"merged":[]}
["Trigger"]
[1]